The Curious Engineer

All blogs / Dev tools / editors / IDEs

Soumitra Mondal's WebLog

learn.microsoft.com/en-us/archive/blogs/smondal

About Visual Studio, Windows Installer and ClickOnce Deployment

Dev tools / editors / IDEsWindows internalsMicrosoft blogsMSDN archive

’10’15’20’25
Posts
96 from 22 May 2009 to 3 Apr 2017
Posting
archived, read-only
Kind
personal blog
Feed
https://learn.microsoft.com/en-us/archive/blogs/smondal/feed.xml

2017 1

  1. VS 2017-Invalid class:System.Management.ManagementException.ThrowWithExtendedInfo(ManagementStatus errorCode)

2016 9

  1. Unable to launch Visual Studio 2015 IDE after removing Update3
  2. Setup detected an issue during the operation. Please click below to check for a solution and help us to improve the setup experience.
  3. Error 1719.The Windows Installer Service could not be accessed
  4. Error 1722. There is a problem with this Windows Installer package
  5. When you install an updated Visual C++ 2013 redistributable package, binaries for non-target architectures are removed
  6. Exception has been thrown by the target of an invocation
  7. Error 1606.Could not access network location
  8. A certificate chain could not be built to a trusted root authority
  9. SignTool Error: The signer's certificate is not valid for signing

2015 3

  1. The imported project "C:Program Files(x86)MsBuildMicrosoftWindowsXamlv14.08.1Microsoft.Windows.UI.Xaml.CSharp.targets" was not found
  2. Error opening installation log file. Verify that the specified log file location exists and that you can write to it.
  3. The setup cannot run in compatibility mode

2014 5

  1. Error 26403.Failed to add user to group
  2. Error 997. Overlapped I/O operation is in progress: KB2918614 breaks Windows Installer Service
  3. delegating uninstallation of assembly file : *** to Fusion
  4. Unrecognized configuration section appSettings
  5. Reference in the manifest does not match the identity of the downloaded assembly

2013 16

  1. Error 1939. The service 'My_Service' could not be configured
  2. A device attached to the system is not functioning
  3. Error 25003. Error occurred while initializing fusion
  4. Visual Studio 2012 fails with an error 'The pipe is being closed'
  5. Visual Studio IDE may crash without any error message
  6. DDSet_Error: CacheGACAssembly failed
  7. An error occurred creating the configuration section handler for userSettings/Microsoft.SqlServer.Configuration.LandingPage.Properties.Settings
  8. The mounted file system does not support extended attributes
  9. Install cannot continue because some required components failed
  10. MSBUILD : error MSB1003: Specify a project or solution file. The current working directory does not contain a project or solution file.
  11. Error: Installation failed for component Microsoft .NET Framework 3.5 (x64) 'package'. MSI returned error code 1603
  12. Error HRESULT E_FAIL has been returned from a call to a COM component
  13. System.TypeLoadException while executing any .Net Framework 2.0 application
  14. MS13-004 patch for .Net 1.1 is re-offered on Windows XP systems even though patch binaries are updated successfully
  15. Failed to connect to server. Error: 0x80004005
  16. Windows SmartScreen prevented an unrecognized app from running. Running this app might put your PC at risk

2012 13

  1. Error 1334. The file '_xxxxxxxxxxxxxxxxxxxxxxxxxxx' cannot be installed because the file cannot be found in cabinet file
  2. KB2698023: "Error 1606.Could not access network location”
  3. Setup.exe is not a valid Win32 application
  4. Unable to cast COM object of type 'System.__ComObject' to interface type 'Microsoft.VisualStudio.OLE.Interop.IServiceProvider'.
  5. Error 1935.An error occurred during the installation of assembly
  6. Installation failed with error code: (0x800B010B), "Generic trust failure”
  7. SignatureDescription could not be created for the signature algorithm supplied
  8. How to work around the Program Compatibility Assistant warning in Visual Studio unattended setup
  9. Failed to install assembly ***** because of system error: The system cannot find the file specified.
  10. An error occurred while signing: Key not valid for use in specified state
  11. MS12-025 : KB2656370 Microsoft .NET Framework 1.1 -- Internal Error 2705. Directory
  12. Reference in the manifest does not match the identity of the downloaded assembly
  13. MS11-100 : KB2656353 Error Microsoft .NET Framework 1.1 -- Internal Error 2705. Directory

2011 13

  1. Removal of a component from a feature is not supported
  2. An error occurred while signing: SignTool.exe not found.
  3. DEBUG: Error 2769: Custom Action CA_InstallAssemblyDef.3643236F_FC70_11D3_A536_0090278A1BB8 did not close 2 MSIHANDLEs.
  4. MS11-049 patch is re-offered through Windows Update
  5. Error 25015.Failed to install assembly 'C:WINDOWSMicrosoft.NETFrameworkv2.0.50727IEExecRemote.dll' because of system error: Access is denied
  6. Executing op: CustomActionSchedule(Action=ExecSecureObjects,ActionType=3073,Source=BinaryData
  7. DDSet_Error: Failed to install assembly 'c:WINNTMicrosoft.NETFrameworkv2.0.50727System.Web.dll' because of system error: Access is denied
  8. Warning 1909.Could not create Shortcut Visual Studio Command Prompt (2010).lnk
  9. .NET Framework Initialization Error
  10. KB2455033 fails to install from Windows Update
  11. .NET Framework 4 Error: "Generic Trust Failure" (0x800B010B)
  12. MS11-028 update causes failure for MMCs and PowerShell to launch
  13. "Error 25007.Error occurred while initializing fusion. Setup could not load fusion with LoadLibraryShim(). Error: 0x80131700"

2010 16

  1. "The application has failed to start because its side-by-side configuration is incorrect. Please see the application event log for more detail."
  2. mmc could not create the snap-in.
  3. You may find slow down in system booting time after installing .NET Framework 4.0 client profile
  4. “Could not load type 'System.Security.Authentication.ExtendedProtection.ExtendedProtectionPolicy'”
  5. “Current thread must be set to single thread apartment (STA) mode before OLE calls can be made”
  6. KB983583(MS10-060) is re-offered by Windows Update
  7. "The upgrade patch can not be installed by the windows installer service because the program to be upgraded may be running or the upgrade patch may update a different version of the program"
  8. Files are removed from the application folder after upgrading a Setup project from Visual Studio 2008 to Visual Studio 2010
  9. KB974417 is re-offered by Windows Update
  10. "25007.Error occurred while initializing fusion. Setup could not load fusion with LoadLibraryShim(). Error: The handle is invalid."
  11. Help Library Agent exception: System.Collections.Generic.KeyNotFoundException: The given key was not present in the dictionary
  12. regcap.exe crashes while building a setup project in Visual Studio 2008
  13. DDSet_Error: Internal error: 2
  14. C# application crashes while building in Visual Studio 2010
  15. "None of the products that are addressed by this software update are installed on this computer. Click Cancel to exit setup."
  16. Visual Studio 2008 Hangs in Design View with ASP.Net web pages

2009 20

  1. Setup.exe has encountered a problem and needs to close
  2. The installation source for this product is not available. Verify that the source exists and that you can access it.
  3. “This setup is not supported on 64-bit versions of Windows XP”
  4. "This advertised application will not be installed because it might be unsafe. Contact your administrator to change the installation user interface option of the package to basic."
  5. We might receive an error “SL****.tmp has stopped working" while installing .Net Framework 1.1 SP1 (NDP1.1sp1-KB867460-X86.exe)
  6. How to create a slipstream package for .Net Framework 1.1 and SP1
  7. How to change the size of ClickOnce cache and how roll back occurs in ClickOnce
  8. After successfully publishing a ClickOnce application, when you try to install the application you receive an XML page on the browser window as IE opens the Application Manifest
  9. While clicking on “Calculate Permissions” button after including “WebPermission” for a partial trust application, prompts a message box “This application requires full trust to run correctly. Would you like to set this as a full trust application?”
  10. .NET Framework 3.5 OR .Net Framework 3.0 Setup might fail while installing WCF components
  11. How to install Expression Blend and SP1 in silent mode
  12. Advertised COM add-in won't trigger on-demand install if you want to deploy the Add-in with the following conditions (HKEY_USERS + COM Add-in + managed desktop<non admin privileges>).
  13. Web Setup (Windows Installer) project created in Visual Studio fails on a Windows 2003 Server
  14. "Xamlviewer" folder is deleted after installing .Net Framework 3.5 SP1 on a Windows XP / Windows 2003 system.
  15. How to add a .net dll within your application setup (Windows Installer Package) using Visual Studio 2005/2008
  16. How to call a .net assembly in VBA using COM Interop
  17. After installing Visual Studio 2008 Standard with only VC++, when you try to build any kind of C++ project you will receive the following error message: Project : error PRJ0003 : Error spawning 'cl.exe'
  18. When you run Performance Wizard after doing custom VSTS install choosing VB only, a dialog box will pop up with an error message “Could not load file or assembly 'Microsoft.VisualStudio.VCProjectEngine, Version=8.0.0.0, Culture=neutral, PublicKeyToken=b03f
  19. ClickOnce Application Security Settings
  20. When you run .NET Framework 3.5 SP1 setup or Microsoft .NET Framework 3.5 Family Update with a user account whose name begins with a '#' character, the installation will fail.